[linux-dvb] dvb-apps doesn't compile

Robert La Ferla robertlaferla at comcast.net
Wed Mar 9 21:38:13 CET 2005


The latest CVS source for dvb-apps also doesn't compile.  Is there a fix?

test_av.c: In function `videoStillPicture':
test_av.c:411: error: storage size of 'sp' isn't known
test_av.c:433: error: invalid application of `sizeof' to incomplete type 
`video_still_picture'
test_av.c:411: warning: unused variable `sp'
make[1]: *** [test_av] Error 1





More information about the linux-dvb mailing list