[linux-dvb] dvb-apps doesn't compile

Kenneth Aafløy lists at kenneth.aafloy.net
Wed Mar 9 22:07:51 CET 2005


On Wednesday 09 March 2005 21:38, Robert La Ferla wrote:
> The latest CVS source for dvb-apps also doesn't compile.  Is there a fix?
> 
> test_av.c: In function `videoStillPicture':
> test_av.c:411: error: storage size of 'sp' isn't known
> test_av.c:433: error: invalid application of `sizeof' to incomplete type 
> `video_still_picture'
> test_av.c:411: warning: unused variable `sp'
> make[1]: *** [test_av] Error 1

Works fine here..
was this all output, or was there more errors or warnings above?

Anyways, you usually don't need the stuff in test, try to cd into util
and do a make there instead.

Kenneth




More information about the linux-dvb mailing list