[linux-dvb] Suse Linux 10.2

thomas schorpp thomas.schorpp at googlemail.com
Mon Jan 21 16:41:37 CET 2008


Dr. Michael Schaale wrote:
> Hi,
> I tried to re-compile the driver staff after a kernel update and ended
> in an error message that I cannot understand ... anybody able to help me
> ?? Thanks !! Kindest regards, Michael
> 

> /tmp3/downloaded_stuff/post-install-10.2/Software/DONE/FIRMWARE/v4l-dvb/v4l/stk-webcam.c:
> In function 'stk_isoc_handler':
> /tmp3/downloaded_stuff/post-install-10.2/Software/DONE/FIRMWARE/v4l-dvb/v4l/stk-webcam.c:400:
> error: implicit declaration of function 'list_first_entry'
> /tmp3/downloaded_stuff/post-install-10.2/Software/DONE/FIRMWARE/v4l-dvb/v4l/stk-webcam.c:401:
> error: expected expression before 'struct'
> /tmp3/downloaded_stuff/post-install-10.2/Software/DONE/FIRMWARE/v4l-dvb/v4l/stk-webcam.c:401:
> warning: assignment makes pointer from integer without a cast
> /tmp3/downloaded_stuff/post-install-10.2/Software/DONE/FIRMWARE/v4l-dvb/v4l/stk-webcam.c:448:
> error: expected expression before 'struct'
> /tmp3/downloaded_stuff/post-install-10.2/Software/DONE/FIRMWARE/v4l-dvb/v4l/stk-webcam.c:448:
> warning: assignment makes pointer from integer without a cast
> /tmp3/downloaded_stuff/post-install-10.2/Software/DONE/FIRMWARE/v4l-dvb/v4l/stk-webcam.c:
> In function 'stk_prepare_iso':
> /tmp3/downloaded_stuff/post-install-10.2/Software/DONE/FIRMWARE/v4l-dvb/v4l/stk-webcam.c:534:
> warning: assignment from incompatible pointer type
> /tmp3/downloaded_stuff/post-install-10.2/Software/DONE/FIRMWARE/v4l-dvb/v4l/stk-webcam.c:
> In function 'v4l_stk_read':
> /tmp3/downloaded_stuff/post-install-10.2/Software/DONE/FIRMWARE/v4l-dvb/v4l/stk-webcam.c:775:
> error: expected expression before 'struct'
> /tmp3/downloaded_stuff/post-install-10.2/Software/DONE/FIRMWARE/v4l-dvb/v4l/stk-webcam.c:775:
> warning: assignment makes pointer from integer without a cast
> /tmp3/downloaded_stuff/post-install-10.2/Software/DONE/FIRMWARE/v4l-dvb/v4l/stk-webcam.c:
> In function 'stk_vidioc_dqbuf':
> /tmp3/downloaded_stuff/post-install-10.2/Software/DONE/FIRMWARE/v4l-dvb/v4l/stk-webcam.c:1225:
> error: expected expression before 'struct'
> /tmp3/downloaded_stuff/post-install-10.2/Software/DONE/FIRMWARE/v4l-dvb/v4l/stk-webcam.c:1225:
> warning: assignment makes pointer from integer without a cast
> make[5]: ***
> [/tmp3/downloaded_stuff/post-install-10.2/Software/DONE/FIRMWARE/v4l-dvb/v4l/stk-webcam.o]
> Error 1
> make[4]: ***
> [_module_/tmp3/downloaded_stuff/post-install-10.2/Software/DONE/FIRMWARE/v4l-dvb/v4l]
> Error 2
> make[3]: *** [modules] Error 2
> make[2]: *** [modules] Error 2
> make[2]: Leaving directory `/usr/src/linux-2.6.18.8-0.7-obj/i386/default'
> make[1]: *** [default] Error 2
> make[1]: Leaving directory
> `/tmp3/downloaded_stuff/post-install-10.2/Software/DONE/FIRMWARE/v4l-dvb/v4l'
> make: *** [all] Error 2
> 

which version? pls do a ~$hg -pull -u

header errors, kernel maintainer's fault or Your v4l-dvb sandbox is out of sync.
anyway, it is not recommended and not really supported to build v4l-dvb hg against such old kernels, 
pls use latest linux release kernel.

y
tom



More information about the linux-dvb mailing list