[vdr] Cannot compile vdr-plugin-streamdev from today cvs against vdr 1.7.11

Goga777 goga777 at bk.ru
Sun Jan 10 09:25:44 CET 2010


> server/connectionVTP.c: In member function ‘bool cLSTEHandler::Next(bool&)’:
> server/connectionVTP.c:303: error: ‘const class cEvent’ has no member 
> named ‘GetContentsString?’
> server/connectionVTP.c:304: error: ‘const class cEvent’ has no member 
> named ‘GetContentsString?’
> make: *** [server/connectionVTP.o] Error 1


I could compile cvs version of streamdev plugin  and vdr 1.7.11 without any problem
http://streamdev.vdr-developer.org/


Goga



More information about the vdr mailing list