Talk:EzCap DVB T Stick

From LinuxTVWiki

Jump to: navigation, search

in kernel 3.1 work fine

but in kernel 3.2

cp: cannot stat `api/.*.o.cmd': No such file or directory make -C /lib/modules/3.2.0-3-686-pae/build SUBDIRS=/home/user/Downloads/installer/AF903x_SRC modules make[1]: Entering directory `/usr/src/linux-headers-3.2.0-3-686-pae'

 CC [M]  /home/user/Downloads/installer/AF903x_SRC/af903x-core.o

In file included from /home/user/Downloads/installer/AF903x_SRC/type.h:4:0,

                from /home/user/Downloads/installer/AF903x_SRC/demodulator.h:5,
                from /home/user/Downloads/installer/AF903x_SRC/af903x.h:17,
                from /home/user/Downloads/installer/AF903x_SRC/af903x-core.c:1:

/home/user/Downloads/installer/AF903x_SRC/userdef.h:11:0: warning: "NULL" redefined [enabled by default] /usr/src/linux-headers-3.2.0-3-common/include/linux/stddef.h:10:0: note: this is the location of the previous definition In file included from /home/user/Downloads/installer/AF903x_SRC/demodulator.h:5:0,

                from /home/user/Downloads/installer/AF903x_SRC/af903x.h:17,
                from /home/user/Downloads/installer/AF903x_SRC/af903x-core.c:1:

/home/user/Downloads/installer/AF903x_SRC/type.h:6:0: warning: "IN" redefined [enabled by default] /home/user/Downloads/installer/AF903x_SRC/userdef.h:21:0: note: this is the location of the previous definition /home/user/Downloads/installer/AF903x_SRC/type.h:7:0: warning: "OUT" redefined [enabled by default] /home/user/Downloads/installer/AF903x_SRC/userdef.h:22:0: note: this is the location of the previous definition /home/user/Downloads/installer/AF903x_SRC/af903x-core.c: In function ‘af903x_suspend’: /home/user/Downloads/installer/AF903x_SRC/af903x-core.c:51:2: warning: passing argument 2 of ‘DL_CheckTunerInited’ from incompatible pointer type [enabled by default] /home/user/Downloads/installer/AF903x_SRC/af903x.h:218:14: note: expected ‘enum Bool *’ but argument is of type ‘bool *’ /home/user/Downloads/installer/AF903x_SRC/af903x-core.c:52:2: warning: passing argument 2 of ‘DL_CheckTunerInited’ from incompatible pointer type [enabled by default] /home/user/Downloads/installer/AF903x_SRC/af903x.h:218:14: note: expected ‘enum Bool *’ but argument is of type ‘bool *’ /home/user/Downloads/installer/AF903x_SRC/af903x-core.c: At top level: /home/user/Downloads/installer/AF903x_SRC/firmware.h:28:13: warning: ‘Firmware_codes’ defined but not used [-Wunused-variable] /home/user/Downloads/installer/AF903x_SRC/firmware.h:10571:16: warning: ‘Firmware_segments’ defined but not used [-Wunused-variable] /home/user/Downloads/installer/AF903x_SRC/firmware.h:10586:13: warning: ‘Firmware_new_partitions’ defined but not used [-Wunused-variable] /home/user/Downloads/installer/AF903x_SRC/firmware.h:10595:13: warning: ‘Firmware_scriptSets’ defined but not used [-Wunused-variable] /home/user/Downloads/installer/AF903x_SRC/firmware.h:10600:17: warning: ‘Firmware_scripts’ defined but not used [-Wunused-variable] /home/user/Downloads/installer/AF903x_SRC/af903x-core.c:41:12: warning: ‘af903x_suspend’ defined but not used [-Wunused-function] /home/user/Downloads/installer/AF903x_SRC/af903x-core.c:64:12: warning: ‘af903x_resume’ defined but not used [-Wunused-function]

 CC [M]  /home/user/Downloads/installer/AF903x_SRC/af903x-devices.o

In file included from /home/user/Downloads/installer/AF903x_SRC/type.h:4:0,

                from /home/user/Downloads/installer/AF903x_SRC/demodulator.h:5,
                from /home/user/Downloads/installer/AF903x_SRC/af903x.h:17,
                from /home/user/Downloads/installer/AF903x_SRC/af903x-devices.c:1:

/home/user/Downloads/installer/AF903x_SRC/userdef.h:11:0: warning: "NULL" redefined [enabled by default] /usr/src/linux-headers-3.2.0-3-common/include/linux/stddef.h:10:0: note: this is the location of the previous definition In file included from /home/user/Downloads/installer/AF903x_SRC/demodulator.h:5:0,

                from /home/user/Downloads/installer/AF903x_SRC/af903x.h:17,
                from /home/user/Downloads/installer/AF903x_SRC/af903x-devices.c:1:

/home/user/Downloads/installer/AF903x_SRC/type.h:6:0: warning: "IN" redefined [enabled by default] /home/user/Downloads/installer/AF903x_SRC/userdef.h:21:0: note: this is the location of the previous definition /home/user/Downloads/installer/AF903x_SRC/type.h:7:0: warning: "OUT" redefined [enabled by default] /home/user/Downloads/installer/AF903x_SRC/userdef.h:22:0: note: this is the location of the previous definition /home/user/Downloads/installer/AF903x_SRC/af903x-devices.c: In function ‘af903x_frontend_attach’: /home/user/Downloads/installer/AF903x_SRC/af903x-devices.c:93:6: error: ‘struct dvb_usb_adapter’ has no member named ‘fe’ /home/user/Downloads/installer/AF903x_SRC/af903x-devices.c:95:13: error: ‘struct dvb_usb_adapter’ has no member named ‘fe’ /home/user/Downloads/installer/AF903x_SRC/af903x-devices.c: In function ‘af903x_tuner_attach’: /home/user/Downloads/installer/AF903x_SRC/af903x-devices.c:105:19: error: ‘struct dvb_usb_adapter’ has no member named ‘fe’ /home/user/Downloads/installer/AF903x_SRC/af903x-devices.c: At top level: /home/user/Downloads/installer/AF903x_SRC/af903x-devices.c:162:5: error: unknown field ‘caps’ specified in initializer /home/user/Downloads/installer/AF903x_SRC/af903x-devices.c:163:5: error: unknown field ‘pid_filter_count’ specified in initializer /home/user/Downloads/installer/AF903x_SRC/af903x-devices.c:163:5: warning: initialization makes pointer from integer without a cast [enabled by default] /home/user/Downloads/installer/AF903x_SRC/af903x-devices.c:163:5: warning: (near initialization for ‘af903x_properties[0].adapter[0].frontend_ctrl’) [enabled by default] /home/user/Downloads/installer/AF903x_SRC/af903x-devices.c:164:5: error: unknown field ‘pid_filter’ specified in initializer /home/user/Downloads/installer/AF903x_SRC/af903x-devices.c:164:5: warning: initialization from incompatible pointer type [enabled by default] /home/user/Downloads/installer/AF903x_SRC/af903x-devices.c:164:5: warning: (near initialization for ‘af903x_properties[0].adapter[0].fe_ioctl_override’) [enabled by default] /home/user/Downloads/installer/AF903x_SRC/af903x-devices.c:165:5: error: unknown field ‘pid_filter_ctrl’ specified in initializer /home/user/Downloads/installer/AF903x_SRC/af903x-devices.c:165:5: warning: initialization makes integer from pointer without a cast [enabled by default] /home/user/Downloads/installer/AF903x_SRC/af903x-devices.c:165:5: warning: (near initialization for ‘af903x_properties[0].adapter[0].num_frontends’) [enabled by default] /home/user/Downloads/installer/AF903x_SRC/af903x-devices.c:166:5: error: unknown field ‘frontend_attach’ specified in initializer /home/user/Downloads/installer/AF903x_SRC/af903x-devices.c:166:5: warning: missing braces around initializer [-Wmissing-braces] /home/user/Downloads/installer/AF903x_SRC/af903x-devices.c:166:5: warning: (near initialization for ‘af903x_properties[0].adapter[0].fe’) [-Wmissing-braces] /home/user/Downloads/installer/AF903x_SRC/af903x-devices.c:166:5: warning: initialization makes integer from pointer without a cast [enabled by default] /home/user/Downloads/installer/AF903x_SRC/af903x-devices.c:166:5: warning: (near initialization for ‘af903x_properties[0].adapter[0].fe[0].caps’) [enabled by default] /home/user/Downloads/installer/AF903x_SRC/af903x-devices.c:167:5: error: unknown field ‘tuner_attach’ specified in initializer /home/user/Downloads/installer/AF903x_SRC/af903x-devices.c:167:5: warning: excess elements in struct initializer [enabled by default] /home/user/Downloads/installer/AF903x_SRC/af903x-devices.c:167:5: warning: (near initialization for ‘af903x_properties[0].adapter[0]’) [enabled by default] /home/user/Downloads/installer/AF903x_SRC/af903x-devices.c:168:5: error: unknown field ‘streaming_ctrl’ specified in initializer /home/user/Downloads/installer/AF903x_SRC/af903x-devices.c:168:5: warning: excess elements in struct initializer [enabled by default] /home/user/Downloads/installer/AF903x_SRC/af903x-devices.c:168:5: warning: (near initialization for ‘af903x_properties[0].adapter[0]’) [enabled by default] /home/user/Downloads/installer/AF903x_SRC/af903x-devices.c:169:5: error: unknown field ‘stream’ specified in initializer /home/user/Downloads/installer/AF903x_SRC/af903x-devices.c:169:5: error: extra brace group at end of initializer /home/user/Downloads/installer/AF903x_SRC/af903x-devices.c:169:5: error: (near initialization for ‘af903x_properties[0].adapter[0]’) /home/user/Downloads/installer/AF903x_SRC/af903x-devices.c:173:6: error: extra brace group at end of initializer /home/user/Downloads/installer/AF903x_SRC/af903x-devices.c:173:6: error: (near initialization for ‘af903x_properties[0].adapter[0]’) /home/user/Downloads/installer/AF903x_SRC/af903x-devices.c:174:7: error: extra brace group at end of initializer /home/user/Downloads/installer/AF903x_SRC/af903x-devices.c:174:7: error: (near initialization for ‘af903x_properties[0].adapter[0]’) /home/user/Downloads/installer/AF903x_SRC/af903x-devices.c:178:5: warning: excess elements in struct initializer [enabled by default] /home/user/Downloads/installer/AF903x_SRC/af903x-devices.c:178:5: warning: (near initialization for ‘af903x_properties[0].adapter[0]’) [enabled by default] /home/user/Downloads/installer/AF903x_SRC/af903x-devices.c:181:28: error: unknown field ‘caps’ specified in initializer /home/user/Downloads/installer/AF903x_SRC/af903x-devices.c:182:28: error: unknown field ‘pid_filter_count’ specified in initializer /home/user/Downloads/installer/AF903x_SRC/af903x-devices.c:182:28: warning: initialization makes pointer from integer without a cast [enabled by default] /home/user/Downloads/installer/AF903x_SRC/af903x-devices.c:182:28: warning: (near initialization for ‘af903x_properties[0].adapter[1].frontend_ctrl’) [enabled by default] /home/user/Downloads/installer/AF903x_SRC/af903x-devices.c:183:28: error: unknown field ‘pid_filter’ specified in initializer /home/user/Downloads/installer/AF903x_SRC/af903x-devices.c:183:28: warning: initialization from incompatible pointer type [enabled by default] /home/user/Downloads/installer/AF903x_SRC/af903x-devices.c:183:28: warning: (near initialization for ‘af903x_properties[0].adapter[1].fe_ioctl_override’) [enabled by default] /home/user/Downloads/installer/AF903x_SRC/af903x-devices.c:184:28: error: unknown field ‘pid_filter_ctrl’ specified in initializer /home/user/Downloads/installer/AF903x_SRC/af903x-devices.c:184:28: warning: initialization makes integer from pointer without a cast [enabled by default] /home/user/Downloads/installer/AF903x_SRC/af903x-devices.c:184:28: warning: (near initialization for ‘af903x_properties[0].adapter[1].num_frontends’) [enabled by default] /home/user/Downloads/installer/AF903x_SRC/af903x-devices.c:185:5: error: unknown field ‘frontend_attach’ specified in initializer /home/user/Downloads/installer/AF903x_SRC/af903x-devices.c:185:5: warning: initialization makes integer from pointer without a cast [enabled by default] /home/user/Downloads/installer/AF903x_SRC/af903x-devices.c:185:5: warning: (near initialization for ‘af903x_properties[0].adapter[1].fe[0].caps’) [enabled by default] /home/user/Downloads/installer/AF903x_SRC/af903x-devices.c:186:5: error: unknown field ‘tuner_attach’ specified in initializer /home/user/Downloads/installer/AF903x_SRC/af903x-devices.c:186:5: warning: excess elements in struct initializer [enabled by default] /home/user/Downloads/installer/AF903x_SRC/af903x-devices.c:186:5: warning: (near initialization for ‘af903x_properties[0].adapter[1]’) [enabled by default] /home/user/Downloads/installer/AF903x_SRC/af903x-devices.c:187:5: error: unknown field ‘streaming_ctrl’ specified in initializer /home/user/Downloads/installer/AF903x_SRC/af903x-devices.c:187:5: warning: excess elements in struct initializer [enabled by default] /home/user/Downloads/installer/AF903x_SRC/af903x-devices.c:187:5: warning: (near initialization for ‘af903x_properties[0].adapter[1]’) [enabled by default] /home/user/Downloads/installer/AF903x_SRC/af903x-devices.c:188:5: error: unknown field ‘stream’ specified in initializer /home/user/Downloads/installer/AF903x_SRC/af903x-devices.c:188:5: error: extra brace group at end of initializer /home/user/Downloads/installer/AF903x_SRC/af903x-devices.c:188:5: error: (near initialization for ‘af903x_properties[0].adapter[1]’) /home/user/Downloads/installer/AF903x_SRC/af903x-devices.c:192:6: error: extra brace group at end of initializer /home/user/Downloads/installer/AF903x_SRC/af903x-devices.c:192:6: error: (near initialization for ‘af903x_properties[0].adapter[1]’) /home/user/Downloads/installer/AF903x_SRC/af903x-devices.c:193:10: error: extra brace group at end of initializer /home/user/Downloads/installer/AF903x_SRC/af903x-devices.c:193:10: error: (near initialization for ‘af903x_properties[0].adapter[1]’) /home/user/Downloads/installer/AF903x_SRC/af903x-devices.c:197:5: warning: excess elements in struct initializer [enabled by default] /home/user/Downloads/installer/AF903x_SRC/af903x-devices.c:197:5: warning: (near initialization for ‘af903x_properties[0].adapter[1]’) [enabled by default] /home/user/Downloads/installer/AF903x_SRC/firmware.h:28:13: warning: ‘Firmware_codes’ defined but not used [-Wunused-variable] /home/user/Downloads/installer/AF903x_SRC/firmware.h:10571:16: warning: ‘Firmware_segments’ defined but not used [-Wunused-variable] /home/user/Downloads/installer/AF903x_SRC/firmware.h:10586:13: warning: ‘Firmware_new_partitions’ defined but not used [-Wunused-variable] /home/user/Downloads/installer/AF903x_SRC/firmware.h:10595:13: warning: ‘Firmware_scriptSets’ defined but not used [-Wunused-variable] /home/user/Downloads/installer/AF903x_SRC/firmware.h:10600:17: warning: ‘Firmware_scripts’ defined but not used [-Wunused-variable] /home/user/Downloads/installer/AF903x_SRC/af903x-devices.c: In function ‘af903x_frontend_attach’: /home/user/Downloads/installer/AF903x_SRC/af903x-devices.c:96:1: warning: control reaches end of non-void function [-Wreturn-type] make[4]: *** [/home/user/Downloads/installer/AF903x_SRC/af903x-devices.o] Error 1 make[3]: *** [_module_/home/user/Downloads/installer/AF903x_SRC] Error 2 make[2]: *** [sub-make] Error 2 make[1]: *** [all] Error 2 make[1]: Leaving directory `/usr/src/linux-headers-3.2.0-3-686-pae' make: *** [default] Error 2 make error

Personal tools